Reaction Details
TargetMu-type opioid receptor
LigandBDBM50007159
Substrate/Competitorn/a
Meas. Tech.ChEBML_146256
Ki 47±n/a nM
Citation Vecchietti, VClarke, GDColle, RGiardina, GPetrone, GSbacchi, M (1S)-1-(aminomethyl)-2-(arylacetyl)-1,2,3,4-tetrahydroisoquinoline and heterocycle-condensed tetrahydropyridine derivatives: members of a novel class of very potent kappa opioid analgesics. J Med Chem34:2624-33 (1991) Mu-type opioid receptor
Name:Mu-type opioid receptor
Type:Enzyme Catalytic Domain
Mol. Mass.:11165.58
Organism:GUINEA PIG
Description:P97266
Residue:98
BDBM50007159
NameBDBM50007159
Synonyms:2-(3,4-Dichloro-phenyl)-1-(4-pyrrolidin-1-ylmethyl-6,7-dihydro-4H-thieno[3,2-c]pyridin-5-yl)-ethanone;HCl | CHEMBL89307
TypeSmall organic molecule
Emp. Form.C20H22Cl2N2OS
Mol. Mass.409.372
SMILESClc1ccc(CC(=O)N2CCc3sccc3C2CN2CCCC2)cc1Cl