Reaction Details
Target5-hydroxytryptamine receptor 1A
LigandBDBM50007170
Substrate/Competitorn/a
Meas. Tech.ChEBML_1117
Ki 0.400000±n/a nM
Citation Raghupathi, RKRydelek-Fitzgerald, LTeitler, MGlennon, RA Analogues of the 5-HT1A serotonin antagonist 1-(2-methoxyphenyl)-4-[4-(2-phthalimido)butyl]piperazine with reduced alpha 1-adrenergic affinity. J Med Chem34:2633-8 (1991) 5-hydroxytryptamine receptor 1A
Name:5-hydroxytryptamine receptor 1A
Type:G Protein-Coupled Receptor (GPCR)
Mol. Mass.:46445.29
Organism:Rattus norvegicus (rat)
Description:Binding assays were performed using rat hippocampal membranes.
Residue:422
BDBM50007170
NameBDBM50007170
Synonyms:Adamantane-1-carboxylic acid {4-[4-(2-methoxy-phenyl)-piperazin-1-yl]-butyl}-amide | CHEMBL26533
TypeSmall organic molecule
Emp. Form.C26H39N3O2
Mol. Mass.425.6068
SMILESCOc1ccccc1N1CCN(CCCCNC(=O)C23C[C@H]4C[C@H](C[C@H](C4)C2)C3)CC1