Reaction Details
Target5-hydroxytryptamine receptor 1A
LigandBDBM50007184
Substrate/Competitorn/a
Meas. Tech.ChEBML_1117
Ki 2±n/a nM
Citation Raghupathi, RKRydelek-Fitzgerald, LTeitler, MGlennon, RA Analogues of the 5-HT1A serotonin antagonist 1-(2-methoxyphenyl)-4-[4-(2-phthalimido)butyl]piperazine with reduced alpha 1-adrenergic affinity. J Med Chem34:2633-8 (1991) 5-hydroxytryptamine receptor 1A
Name:5-hydroxytryptamine receptor 1A
Type:G Protein-Coupled Receptor (GPCR)
Mol. Mass.:46445.29
Organism:Rattus norvegicus (rat)
Description:Binding assays were performed using rat hippocampal membranes.
Residue:422
BDBM50007184
NameBDBM50007184
Synonyms:3,4-Dichloro-N-{4-[4-(2-methoxy-phenyl)-piperazin-1-yl]-butyl}-benzamide | CHEMBL27996
TypeSmall organic molecule
Emp. Form.C22H27Cl2N3O2
Mol. Mass.436.375
SMILESCOc1ccccc1N1CCN(CCCCNC(=O)c2ccc(Cl)c(Cl)c2)CC1