Reaction Details
TargetRho-associated protein kinase 1
LigandBDBM50253759
Substrate/Competitorn/a
Meas. Tech.ChEBML_1685778
IC50 160±n/a nM
Citation Kurasawa, OHomma, MOguro, YMiyazaki, TMori, KUchiyama, NIwai, KOhashi, AHara, HYoshida, SCho, N 2-Aminomethylthieno[3,2-d]pyrimidin-4(3H)-ones bearing 3-methylpyrazole hinge binding moiety: Highly potent, selective, and time-dependent inhibitors of Cdc7 kinase. Bioorg Med Chem25:3658-3670 (2017) 
 
Rho-associated protein kinase 1
Name:Rho-associated protein kinase 1
Type:Serine/threonine-protein kinase
Mol. Mass.:158156.77
Organism:Homo sapiens (Human)
Description:Q13464
Residue:1354
BDBM50253759
NameBDBM50253759
Synonyms:CHEMBL4078941
TypeSmall organic molecule
Emp. Form.C16H21Cl2N5OS
Mol. Mass.402.342
SMILESCl.Cl.C[C@H]1CCCN1Cc1nc2cc(sc2c(=O)[nH]1)-c1c[nH]nc1C