Reaction Details
TargetRho-associated protein kinase 1
LigandBDBM50253760
Substrate/Competitorn/a
Meas. Tech.ChEBML_1685778
IC50 170±n/a nM
Citation Kurasawa, OHomma, MOguro, YMiyazaki, TMori, KUchiyama, NIwai, KOhashi, AHara, HYoshida, SCho, N 2-Aminomethylthieno[3,2-d]pyrimidin-4(3H)-ones bearing 3-methylpyrazole hinge binding moiety: Highly potent, selective, and time-dependent inhibitors of Cdc7 kinase. Bioorg Med Chem25:3658-3670 (2017) 
 
Rho-associated protein kinase 1
Name:Rho-associated protein kinase 1
Type:Serine/threonine-protein kinase
Mol. Mass.:158156.77
Organism:Homo sapiens (Human)
Description:Q13464
Residue:1354
BDBM50253760
NameBDBM50253760
Synonyms:CHEMBL4105646
TypeSmall organic molecule
Emp. Form.C21H21N5OS
Mol. Mass.391.489
SMILESCc1n[nH]cc1-c1cc2nc(CN3CCC(C3)c3ccccc3)[nH]c(=O)c2s1