Reaction Details
TargetAtrial natriuretic peptide receptor 3
LigandBDBM50254063
Substrate/Competitorn/a
Meas. Tech.ChEBML_1686038
IC50 0.058000±n/a nM
Citation Nishizawa, NNakamura, GNoguchi, YNakagawa, HShimizu, ANakayama, MTakekawa, SAsami, T A potent and selective natriuretic peptide receptor-3 blocker 11-mer peptide created by hybridization of musclin and atrial natriuretic peptide. Bioorg Med Chem Lett27:3542-3545 (2017) 
 
Atrial natriuretic peptide receptor 3
Name:Atrial natriuretic peptide receptor 3
Type:PROTEIN
Mol. Mass.:59805.12
Organism:Homo sapiens (Human)
Description:ChEMBL_34991
Residue:541
BDBM50254063
NameBDBM50254063
Synonyms:CHEMBL4102000
TypeSmall organic molecule
Emp. Form.C127H203N45O39S3
Mol. Mass.3080.444
SMILESCC[C@H](C)[C@@H]1NC(=O)[C@H](CCCNC(N)=N)NC(=O)[C@H](CC(O)=O)NC(=O)[C@H](CCSC)NC(=O)[C@H](CCCNC(N)=N)NC(=O)CNC(=O)CNC(=O)[C@H](Cc2ccccc2)NC(=O)[C@H](CSSC[C@H](NCC(=O)NC(=O)[C@H](CC(C)C)NC(=O)CNC(=O)[C@H](CO)NC(=O)[C@H](CCC(N)=O)NC(=O)[C@H](C)NC(=O)CNC1=O)C(=O)N[C@@H](CC(N)=O)C(=O)N[C@@H](CO)C(=O)N[C@@H](Cc1ccccc1)C(=O)N[C@@H](CCCNC(N)=N)C(=O)N[C@@H](Cc1ccc(O)cc1)C(O)=O)NC(=O)[C@H](CO)NC(=O)[C@H](CO)NC(=O)[C@H](CCCNC(N)=N)NC(=O)[C@H](CCCNC(N)=N)NC(=O)[C@H](CC(C)C)NC(=O)[C@@H](N)CO