Reaction Details
TargetAtrial natriuretic peptide receptor 3
LigandBDBM50254087
Substrate/Competitorn/a
Meas. Tech.ChEBML_1686038
IC50 1.2±n/a nM
Citation Nishizawa, NNakamura, GNoguchi, YNakagawa, HShimizu, ANakayama, MTakekawa, SAsami, T A potent and selective natriuretic peptide receptor-3 blocker 11-mer peptide created by hybridization of musclin and atrial natriuretic peptide. Bioorg Med Chem Lett27:3542-3545 (2017) 
 
Atrial natriuretic peptide receptor 3
Name:Atrial natriuretic peptide receptor 3
Type:PROTEIN
Mol. Mass.:59805.12
Organism:Homo sapiens (Human)
Description:ChEMBL_34991
Residue:541
BDBM50254087
NameBDBM50254087
Synonyms:CHEMBL4075426
TypeSmall organic molecule
Emp. Form.C57H95N19O15
Mol. Mass.1286.4825
SMILESCC[C@H](C)[C@H](NC(=O)[C@H](CCCNC(N)=N)NC(=O)[C@H](CC(O)=O)NC(=O)[C@@H](NC(=O)[C@H](CCCNC(N)=N)NC(=O)CNC(=O)CNC(=O)[C@H](CC1CCCCC1)NC(=O)CNC(=O)[C@H](CO)NC(=O)[C@@H](N)Cc1ccccc1)[C@@H](C)CC)C(=O)NCC(N)=O