Reaction Details
TargetLysosomal acid glucosylceramidase
LigandBDBM50254119
Substrate/Competitorn/a
Meas. Tech.ChEBML_1686054
Ki 123000±n/a nM
Citation Schalli, MWeber, PTysoe, CPabst, BMThonhofer, MPaschke, EStütz, AETschernutter, MWindischhofer, WWithers, SG A new type of pharmacological chaperone for G Bioorg Med Chem Lett27:3431-3435 (2017) 
 
Lysosomal acid glucosylceramidase
Name:Lysosomal acid glucosylceramidase
Type:Enzyme
Mol. Mass.:59724.64
Organism:Homo sapiens (Human)
Description:The beta-Glu activity was measured with commercially available beta-glucocerebrosidase (Ceredase) as the enzyme source.
Residue:536
BDBM50254119
NameBDBM50254119
Synonyms:CHEMBL4098625
TypeSmall organic molecule
Emp. Form.C10H19NO4
Mol. Mass.217.2622
SMILESOC[C@@H]1[C@H](O)[C@H](O)[C@@H](O)[C@@H]1N1CCCC1