Reaction Details
TargetBeta-galactosidase
LigandBDBM50254117
Substrate/Competitorn/a
Meas. Tech.ChEBML_1686052
Ki 130±n/a nM
Citation Schalli, MWeber, PTysoe, CPabst, BMThonhofer, MPaschke, EStütz, AETschernutter, MWindischhofer, WWithers, SG A new type of pharmacological chaperone for G Bioorg Med Chem Lett27:3431-3435 (2017) 
 
Beta-galactosidase
Name:Beta-galactosidase
Type:Protein
Mol. Mass.:73420.88
Organism:Bos taurus (Bovine)
Description:n/a
Residue:653
BDBM50254117
NameBDBM50254117
Synonyms:CHEMBL4061246
TypeSmall organic molecule
Emp. Form.C10H18N2O4
Mol. Mass.230.2609
SMILESOC[C@@H]1[C@H](O)[C@H](O)[C@@H](O)[C@@H]1NCCCC#N