Reaction Details
TargetDelta-type opioid receptor
LigandBDBM50254122
Substrate/Competitorn/a
Meas. Tech.ChEMBL_1686073 (CHEMBL4036552)
Ki 1.5±n/a nM
Citation Watanabe, YHayashida, KSaito, DTakahashi, TSakai, JNakata, EKanda, TIwai, THirayama, SFujii, HYamakawa, TNagase, H Design and synthesis of novel? opioid receptor agonists with an azatricyclodecane skeleton for improving blood-brain barrier penetration. Bioorg Med Chem Lett27:3495-3498 (2017) 
 
Delta-type opioid receptor
Name:Delta-type opioid receptor
Type:G Protein-Coupled Receptor (GPCR)
Mol. Mass.:40382.98
Organism:Homo sapiens (Human)
Description:Competition binding assays were carried out using membrane preparations from transfected HN9.10 cells that constitutively expressed the delta opioid receptor.
Residue:372
BDBM50254122
NameBDBM50254122
Synonyms:CHEMBL4098662
TypeSmall organic molecule
Emp. Form.C30H42N2O
Mol. Mass.446.6673
SMILES[H][C@]12CN(CC3CCCCC3)C3CCC4(C1)C1Cc5ccc(O)cc5C4(CCN1CC1CC1)C23