Reaction Details
TargetKappa-type opioid receptor
LigandBDBM50254130
Substrate/Competitorn/a
Meas. Tech.ChEMBL_1686075 (CHEMBL4036554)
Ki 4.3±n/a nM
Citation Watanabe, YHayashida, KSaito, DTakahashi, TSakai, JNakata, EKanda, TIwai, THirayama, SFujii, HYamakawa, TNagase, H Design and synthesis of novel? opioid receptor agonists with an azatricyclodecane skeleton for improving blood-brain barrier penetration. Bioorg Med Chem Lett27:3495-3498 (2017) 
 
Kappa-type opioid receptor
Name:Kappa-type opioid receptor
Type:G Protein-Coupled Receptor (GPCR)
Mol. Mass.:42648.76
Organism:Homo sapiens (Human)
Description:P41145
Residue:380
BDBM50254130
NameBDBM50254130
Synonyms:CHEMBL4061334
TypeSmall organic molecule
Emp. Form.C30H36N2O
Mol. Mass.440.6196
SMILES[H][C@]12CN(Cc3ccccc3)C3CCC4(C1)C1Cc5ccc(O)cc5C4(CCN1CC1CC1)C23