Reaction Details
TargetPotassium voltage-gated channel subfamily H member 2
LigandBDBM50254142
Substrate/Competitorn/a
Meas. Tech.ChEMBL_1686117 (CHEMBL4036596)
IC50 24900±n/a nM
Citation Mitton-Fry, MJBrickner, SJHamel, JCBarham, RBrennan, LCasavant, JMDing, XFinegan, SHardink, JHoang, THuband, MDMaloney, MMarfat, AMcCurdy, SPMcLeod, DSubramanyam, CPlotkin, MReilly, USchafer, JStone, GGUccello, DPWisialowski, TYoon, KZaniewski, RZook, C Novel 3-fluoro-6-methoxyquinoline derivatives as inhibitors of bacterial DNA gyrase and topoisomerase IV. Bioorg Med Chem Lett27:3353-3358 (2017) 
 
Potassium voltage-gated channel subfamily H member 2
Name:Potassium voltage-gated channel subfamily H member 2
Type:Multi-pass membrane protein
Mol. Mass.:126672.65
Organism:Homo sapiens (Human)
Description:Q12809
Residue:1159
BDBM50254142
NameBDBM50254142
Synonyms:CHEMBL2382287
TypeSmall organic molecule
Emp. Form.C29H34N2O4
Mol. Mass.474.5913
SMILESCOc1ccc2nccc([C@@H](O)CC[C@@H]3CCN(C[C@@H]3C(O)=O)C3CC(C3)c3ccccc3)c2c1