Reaction Details
TargetLysine-specific histone demethylase 1A
LigandBDBM50075487
Substrate/Competitorn/a
Meas. Tech.ChEBML_1686155
IC50 3130±n/a nM
Citation Ding, LWang, ZZSun, XDYang, JMa, CYLi, WLiu, HM 3D-QSAR (CoMFA, CoMSIA), molecular docking and molecular dynamics simulations study of 6-aryl-5-cyano-pyrimidine derivatives to explore the structure requirements of LSD1 inhibitors. Bioorg Med Chem Lett27:3521-3528 (2017) 
 
Lysine-specific histone demethylase 1A
Name:Lysine-specific histone demethylase 1A
Type:Enzyme
Mol. Mass.:92901.01
Organism:Homo sapiens (Human)
Description:O60341
Residue:852
BDBM50075487
NameBDBM50075487
Synonyms:CHEMBL3415540
TypeSmall organic molecule
Emp. Form.C17H14ClN3O3S
Mol. Mass.375.829
SMILESCOc1cc(cc(OC)c1OC)-c1nc(SCC#C)nc(Cl)c1C#N