Reaction Details
TargetNicotinamide phosphoribosyltransferase
LigandBDBM253899
Substrate/Competitorn/a
Meas. Tech.ChEBML_1686176
Ki 2200±n/a nM
Citation Curtin, MLHeyman, HRClark, RFSorensen, BKDoherty, GAHansen, TMFrey, RRSarris, KAAguirre, ALShrestha, ATu, NWoller, KPliushchev, MASweis, RFCheng, MWilsbacher, JLKovar, PJGuo, JCheng, DLongenecker, KLRaich, DKorepanova, AVSoni, NBAlgire, MARichardson, PLMarin, VLBadagnani, IVasudevan, ABuchanan, FGMaag, DChiang, GGTse, CMichaelides, MR SAR and characterization of non-substrate isoindoline urea inhibitors of nicotinamide phosphoribosyltransferase (NAMPT). Bioorg Med Chem Lett27:3317-3325 (2017) 
 
Nicotinamide phosphoribosyltransferase
Name:Nicotinamide phosphoribosyltransferase
Type:Enzyme
Mol. Mass.:55524.98
Organism:Homo sapiens (Human)
Description:P43490
Residue:491
BDBM253899
NameBDBM253899
Synonyms:US9459250, E104
TypeSmall organic molecule
Emp. Form.C16H16N2O
Mol. Mass.252.311
SMILESCc1ccc(NC(=O)N2Cc3ccccc3C2)cc1