Reaction Details
TargetNicotinamide phosphoribosyltransferase
LigandBDBM217207
Substrate/Competitorn/a
Meas. Tech.ChEBML_1686176
Ki 350±n/a nM
Citation Curtin, MLHeyman, HRClark, RFSorensen, BKDoherty, GAHansen, TMFrey, RRSarris, KAAguirre, ALShrestha, ATu, NWoller, KPliushchev, MASweis, RFCheng, MWilsbacher, JLKovar, PJGuo, JCheng, DLongenecker, KLRaich, DKorepanova, AVSoni, NBAlgire, MARichardson, PLMarin, VLBadagnani, IVasudevan, ABuchanan, FGMaag, DChiang, GGTse, CMichaelides, MR SAR and characterization of non-substrate isoindoline urea inhibitors of nicotinamide phosphoribosyltransferase (NAMPT). Bioorg Med Chem Lett27:3317-3325 (2017) 
 
Nicotinamide phosphoribosyltransferase
Name:Nicotinamide phosphoribosyltransferase
Type:Enzyme
Mol. Mass.:55524.98
Organism:Homo sapiens (Human)
Description:P43490
Residue:491
BDBM217207
NameBDBM217207
Synonyms:US9302989, 808
TypeSmall organic molecule
Emp. Form.C20H25N3O3S
Mol. Mass.387.496
SMILESCC(C)CCNS(=O)(=O)c1ccc(NC(=O)N2Cc3ccccc3C2)cc1