Reaction Details
TargetNicotinamide phosphoribosyltransferase
LigandBDBM215890
Substrate/Competitorn/a
Meas. Tech.ChEBML_1686176
Ki 23±n/a nM
Citation Curtin, MLHeyman, HRClark, RFSorensen, BKDoherty, GAHansen, TMFrey, RRSarris, KAAguirre, ALShrestha, ATu, NWoller, KPliushchev, MASweis, RFCheng, MWilsbacher, JLKovar, PJGuo, JCheng, DLongenecker, KLRaich, DKorepanova, AVSoni, NBAlgire, MARichardson, PLMarin, VLBadagnani, IVasudevan, ABuchanan, FGMaag, DChiang, GGTse, CMichaelides, MR SAR and characterization of non-substrate isoindoline urea inhibitors of nicotinamide phosphoribosyltransferase (NAMPT). Bioorg Med Chem Lett27:3317-3325 (2017) 
 
Nicotinamide phosphoribosyltransferase
Name:Nicotinamide phosphoribosyltransferase
Type:Enzyme
Mol. Mass.:55524.98
Organism:Homo sapiens (Human)
Description:P43490
Residue:491
BDBM215890
NameBDBM215890
Synonyms:US9302989, 86
TypeSmall organic molecule
Emp. Form.C22H24F3N3O2
Mol. Mass.419.4401
SMILESCC(C)CCNC(=O)c1ccc(NC(=O)N2Cc3ccc(cc3C2)C(F)(F)F)cc1