Reaction Details
TargetNicotinamide phosphoribosyltransferase
LigandBDBM50254190
Substrate/Competitorn/a
Meas. Tech.ChEBML_1686176
Ki>9000±n/a nM
Citation Curtin, MLHeyman, HRClark, RFSorensen, BKDoherty, GAHansen, TMFrey, RRSarris, KAAguirre, ALShrestha, ATu, NWoller, KPliushchev, MASweis, RFCheng, MWilsbacher, JLKovar, PJGuo, JCheng, DLongenecker, KLRaich, DKorepanova, AVSoni, NBAlgire, MARichardson, PLMarin, VLBadagnani, IVasudevan, ABuchanan, FGMaag, DChiang, GGTse, CMichaelides, MR SAR and characterization of non-substrate isoindoline urea inhibitors of nicotinamide phosphoribosyltransferase (NAMPT). Bioorg Med Chem Lett27:3317-3325 (2017) 
 
Nicotinamide phosphoribosyltransferase
Name:Nicotinamide phosphoribosyltransferase
Type:Enzyme
Mol. Mass.:55524.98
Organism:Homo sapiens (Human)
Description:P43490
Residue:491
BDBM50254190
NameBDBM50254190
Synonyms:CHEMBL4062656
TypeSmall organic molecule
Emp. Form.C23H29N3O4
Mol. Mass.411.4941
SMILESCOc1cc2CN(Cc2cc1OC)C(=O)Nc1ccc(cc1)C(=O)NCCC(C)C