Reaction Details
TargetNicotinamide phosphoribosyltransferase
LigandBDBM50254191
Substrate/Competitorn/a
Meas. Tech.ChEBML_1686176
Ki>8900±n/a nM
Citation Curtin, MLHeyman, HRClark, RFSorensen, BKDoherty, GAHansen, TMFrey, RRSarris, KAAguirre, ALShrestha, ATu, NWoller, KPliushchev, MASweis, RFCheng, MWilsbacher, JLKovar, PJGuo, JCheng, DLongenecker, KLRaich, DKorepanova, AVSoni, NBAlgire, MARichardson, PLMarin, VLBadagnani, IVasudevan, ABuchanan, FGMaag, DChiang, GGTse, CMichaelides, MR SAR and characterization of non-substrate isoindoline urea inhibitors of nicotinamide phosphoribosyltransferase (NAMPT). Bioorg Med Chem Lett27:3317-3325 (2017) 
 
Nicotinamide phosphoribosyltransferase
Name:Nicotinamide phosphoribosyltransferase
Type:Enzyme
Mol. Mass.:55524.98
Organism:Homo sapiens (Human)
Description:P43490
Residue:491
BDBM50254191
NameBDBM50254191
Synonyms:CHEMBL4090863
TypeSmall organic molecule
Emp. Form.C21H25N3O2
Mol. Mass.351.4421
SMILESCC(C)CCNC(=O)c1cccc(NC(=O)N2Cc3ccccc3C2)c1