Reaction Details
TargetNicotinamide phosphoribosyltransferase
LigandBDBM215863
Substrate/Competitorn/a
Meas. Tech.ChEBML_1686176
Ki 16±n/a nM
Citation Curtin, MLHeyman, HRClark, RFSorensen, BKDoherty, GAHansen, TMFrey, RRSarris, KAAguirre, ALShrestha, ATu, NWoller, KPliushchev, MASweis, RFCheng, MWilsbacher, JLKovar, PJGuo, JCheng, DLongenecker, KLRaich, DKorepanova, AVSoni, NBAlgire, MARichardson, PLMarin, VLBadagnani, IVasudevan, ABuchanan, FGMaag, DChiang, GGTse, CMichaelides, MR SAR and characterization of non-substrate isoindoline urea inhibitors of nicotinamide phosphoribosyltransferase (NAMPT). Bioorg Med Chem Lett27:3317-3325 (2017) 
 
Nicotinamide phosphoribosyltransferase
Name:Nicotinamide phosphoribosyltransferase
Type:Enzyme
Mol. Mass.:55524.98
Organism:Homo sapiens (Human)
Description:P43490
Residue:491
BDBM215863
NameBDBM215863
Synonyms:US9302989, 59
TypeSmall organic molecule
Emp. Form.C22H27N3O3
Mol. Mass.381.4681
SMILESCOc1ccc2CN(Cc2c1)C(=O)Nc1ccc(cc1)C(=O)NCCC(C)C