Reaction Details
TargetHistamine H1 receptor
LigandBDBM50007540
Substrate/Competitorn/a
Meas. Tech.ChEBML_83771
IC50 430±n/a nM
Citation Sleevi, MCCale, ADGero, TWJaques, LWWelstead, WJJohnson, AFKilpatrick, BFDemian, INolan, JCJenkins, H Optical isomers of rocastine and close analogues: synthesis and H1 antihistaminic activity of its enantiomers and their structural relationship to the classical antihistamines. J Med Chem34:1314-28 (1991) Histamine H1 receptor
Name:Histamine H1 receptor
Type:G Protein-Coupled Receptor (GPCR)
Mol. Mass.:55641.53
Organism:Cavia porcellus (domestic guinea pig)
Description:Guinea pig cerebellum was used in binding assay.
Residue:488
BDBM50007540
NameBDBM50007540
Synonyms:CHEMBL279907 | [3-(4-Chloro-phenyl)-3-(5-chloro-pyridin-2-yl)-propyl]-dimethyl-amine
TypeSmall organic molecule
Emp. Form.C16H18Cl2N2
Mol. Mass.309.234
SMILESCN(C)CCC(c1ccc(Cl)cc1)c1ccc(Cl)cn1