Reaction Details
TargetHistamine H1 receptor
LigandBDBM50007536
Substrate/Competitorn/a
Meas. Tech.ChEBML_83771
IC50 24±n/a nM
Citation Sleevi, MCCale, ADGero, TWJaques, LWWelstead, WJJohnson, AFKilpatrick, BFDemian, INolan, JCJenkins, H Optical isomers of rocastine and close analogues: synthesis and H1 antihistaminic activity of its enantiomers and their structural relationship to the classical antihistamines. J Med Chem34:1314-28 (1991) Histamine H1 receptor
Name:Histamine H1 receptor
Type:G Protein-Coupled Receptor (GPCR)
Mol. Mass.:55641.53
Organism:Cavia porcellus (domestic guinea pig)
Description:Guinea pig cerebellum was used in binding assay.
Residue:488
BDBM50007536
NameBDBM50007536
Synonyms:CHEMBL24517 | [3-(5-Chloro-pyridin-2-yl)-3-pyridin-2-yl-propyl]-dimethyl-amine
TypeSmall organic molecule
Emp. Form.C15H18ClN3
Mol. Mass.275.777
SMILESCN(C)CCC(c1ccccn1)c1ccc(Cl)cn1