Reaction Details
TargetTransient receptor potential cation channel subfamily A member 1
LigandBDBM50254387
Substrate/Competitorn/a
Meas. Tech.ChEBML_1686345
IC50 20±n/a nM
Citation Pryde, DCMarron, BEWest, CWReister, SAmato, GYoger, KAntonio, BPadilla, KCox, PJTurner, JWarmus, JSSwain, NAOmoto, KMahoney, JHGerlach, AC Discovery of a Series of Indazole TRPA1 Antagonists. ACS Med Chem Lett8:666-671 (2017) 
 
Transient receptor potential cation channel subfamily A member 1
Name:Transient receptor potential cation channel subfamily A member 1
Type:Protein
Mol. Mass.:127514.20
Organism:Homo sapiens (Human)
Description:O75762
Residue:1119
BDBM50254387
NameBDBM50254387
Synonyms:CHEMBL4062193
TypeSmall organic molecule
Emp. Form.C13H7F5N4O
Mol. Mass.330.2129
SMILESFc1ccc(Nc2n[nH]c3cc(OC(F)(F)F)cnc23)cc1F