Reaction Details
TargetTransient receptor potential cation channel subfamily A member 1
LigandBDBM50254402
Substrate/Competitorn/a
Meas. Tech.ChEBML_1686336
IC50 9.0±n/a nM
Citation Pryde, DCMarron, BEWest, CWReister, SAmato, GYoger, KAntonio, BPadilla, KCox, PJTurner, JWarmus, JSSwain, NAOmoto, KMahoney, JHGerlach, AC Discovery of a Series of Indazole TRPA1 Antagonists. ACS Med Chem Lett8:666-671 (2017) 
 
Transient receptor potential cation channel subfamily A member 1
Name:Transient receptor potential cation channel subfamily A member 1
Type:PROTEIN
Mol. Mass.:128622.74
Organism:Rattus norvegicus
Description:ChEMBL_1450487
Residue:1125
BDBM50254402
NameBDBM50254402
Synonyms:CHEMBL4098431
TypeSmall organic molecule
Emp. Form.C14H8F5N3
Mol. Mass.313.2254
SMILESFc1ccc(Nc2n[nH]c3cc(ccc23)C(F)(F)F)cc1F