Reaction Details
TargetTransient receptor potential cation channel subfamily A member 1
LigandBDBM50254487
Substrate/Competitorn/a
Meas. Tech.ChEBML_1686345
IC50 131±n/a nM
Citation Pryde, DCMarron, BEWest, CWReister, SAmato, GYoger, KAntonio, BPadilla, KCox, PJTurner, JWarmus, JSSwain, NAOmoto, KMahoney, JHGerlach, AC Discovery of a Series of Indazole TRPA1 Antagonists. ACS Med Chem Lett8:666-671 (2017) 
 
Transient receptor potential cation channel subfamily A member 1
Name:Transient receptor potential cation channel subfamily A member 1
Type:Protein
Mol. Mass.:127514.20
Organism:Homo sapiens (Human)
Description:O75762
Residue:1119
BDBM50254487
NameBDBM50254487
Synonyms:CHEMBL4060024
TypeSmall organic molecule
Emp. Form.C14H8F5N3O
Mol. Mass.329.2248
SMILESFc1ccc(Nc2n[nH]c3cc(OC(F)(F)F)ccc23)cc1F