Reaction Details
TargetKappa-type opioid receptor
LigandBDBM50254705
Substrate/Competitorn/a
Meas. Tech.ChEMBL_1686384 (CHEMBL4036863)
Ki 85±n/a nM
Citation Bohn, LMAubé, J Seeking (and Finding) Biased Ligands of the Kappa Opioid Receptor. ACS Med Chem Lett8:694-700 (2017) 
 
Kappa-type opioid receptor
Name:Kappa-type opioid receptor
Type:G Protein-Coupled Receptor (GPCR)
Mol. Mass.:42648.76
Organism:Homo sapiens (Human)
Description:P41145
Residue:380
BDBM50254705
NameBDBM50254705
Synonyms:CHEMBL4068633
TypeSmall organic molecule
Emp. Form.C25H24F4N2O2
Mol. Mass.460.4639
SMILES[H][C@]12CCN(Cc3ccccc3F)C(=O)[C@@]1([H])[C@H](CC=C2)C(=O)Nc1ccc(C)c(c1)C(F)(F)F