Reaction Details
TargetCytochrome P450 3A4
LigandBDBM50254772
Substrate/Competitorn/a
Meas. Tech.ChEBML_1686497
IC50 440±n/a nM
Citation Parcella, KEastman, KYeung, KSGrant-Young, KAZhu, JWang, TZhang, ZYin, ZParker, DMosure, KFang, HWang, YKLemm, JZhuo, XHanumegowda, ULiu, MRigat, KDonoso, MTuttle, MZvyaga, THaarhoff, ZMeanwell, NASoars, MGRoberts, SBKadow, JF Improving Metabolic Stability with Deuterium: The Discovery of BMT-052, a Pan-genotypic HCV NS5B Polymerase Inhibitor. ACS Med Chem Lett8:771-774 (2017) 
 
Cytochrome P450 3A4
Name:Cytochrome P450 3A4
Type:Enzyme
Mol. Mass.:57349.57
Organism:Homo sapiens (Human)
Description:n/a
Residue:503
BDBM50254772
NameBDBM50254772
Synonyms:CHEMBL4061621
TypeSmall organic molecule
Emp. Form.C30H26F4N6O5
Mol. Mass.626.5583
SMILESCNC(=O)c1c(oc2nc(CCC(F)(F)F)c(cc12)-c1cc(C(=O)NC(C)(C)c2ncon2)c(=O)n(C)c1)-c1ccc(F)cc1