Reaction Details
TargetPolyamine deacetylase HDAC10
LigandBDBM50397360
Substrate/Competitorn/a
Meas. Tech.ChEMBL_1686588 (CHEMBL4037067)
IC50 13000±n/a nM
Citation Bourguet, EOzdarska, KMoroy, GJeanblanc, JNaassila, M Class I HDAC Inhibitors: Potential New Epigenetic Therapeutics for Alcohol Use Disorder (AUD). J Med Chem61:1745-1766 (2018) 
 
Polyamine deacetylase HDAC10
Name:Polyamine deacetylase HDAC10
Type:Chromatin regulator; hydrolase; repressor
Mol. Mass.:71431.89
Organism:Homo sapiens (Human)
Description:Q969S8
Residue:669
BDBM50397360
NameBDBM50397360
Synonyms:CHEMBL2170177 | US10188756, Compound CN110
TypeSmall organic molecule
Emp. Form.C17H16N2O3
Mol. Mass.296.3205
SMILESCOc1ccc(Cn2ccc3ccc(cc23)C(=O)NO)cc1