Reaction Details
TargetRetinoic acid receptor alpha
LigandBDBM50032675
Substrate/Competitorn/a
Meas. Tech.ChEBML_1686646
EC50>10000±n/a nM
Citation Talele, TT Natural-Products-Inspired Use of the gem-Dimethyl Group in Medicinal Chemistry. J Med Chem61:2166-2210 (2018) 
 
Retinoic acid receptor alpha
Name:Retinoic acid receptor alpha
Type:PROTEIN
Mol. Mass.:50778.87
Organism:Homo sapiens (Human)
Description:ChEMBL_1466191
Residue:462
BDBM50032675
NameBDBM50032675
Synonyms:4-[1-(3,5,5,8,8-pentamethyl-5,6,7,8-tetrahydronaphthalen-2-yl)vinyl]benzoic acid CHEMBL1023 | p-(1-(5,6,7,8-Tetrahydro-3,5,5,8,8-pentamethyl-2-naphthyl)vinyl)benzoic acid
TypeSmall organic molecule
Emp. Form.C24H28O2
Mol. Mass.348.4779
SMILESCc1cc2c(cc1C(=C)c1ccc(cc1)C(O)=O)C(C)(C)CCC2(C)C