Reaction Details
TargetSodium/potassium-transporting ATPase subunit alpha-4/beta-1
LigandBDBM50255122
Substrate/Competitorn/a
Meas. Tech.ChEBML_1686866
IC50 0.600000±n/a nM
Citation Syeda, SSSánchez, GHong, KHHawkinson, JEGeorg, GIBlanco, G Design, Synthesis, and in Vitro and in Vivo Evaluation of Ouabain Analogues as Potent and Selective Na,K-ATPase?4 Isoform Inhibitors for Male Contraception. J Med Chem61:1800-1820 (2018) 
 
Sodium/potassium-transporting ATPase subunit alpha-4/beta-1
Name:Sodium/potassium-transporting ATPase subunit alpha-4/beta-1
Synonyms:N+/K+ ATPase alpha-4/beta-1
Type:n/a
Mol. Mass.:n/a
Description:ASSAY_ID of ChEMBL is 1686866
Components:This complex has 2 components.
Component 1
Name:Sodium/potassium-transporting ATPase subunit alpha-4
Type:PROTEIN
Mol. Mass.:113994.51
Organism:Rattus norvegicus
Description:ChEMBL_117736
Residue:1028
Component 2
Name:Sodium/potassium-transporting ATPase subunit beta-1
Synonyms:AT1B1_RAT N+/K+ ATPase alpha-4/beta-1 Sodium/potassium-transporting ATPase subunit beta-1
Type:PROTEIN
Mol. Mass.:35208.73
Organism:Rattus norvegicus
Description:ChEMBL_117735
Residue:304
BDBM50255122
NameBDBM50255122
Synonyms:CHEMBL4059538
TypeSmall organic molecule
Emp. Form.C36H60O13
Mol. Mass.700.8538
SMILES[H][C@]12OC(C)(C)O[C@@]1([H])[C@]([H])(O[C@H]1C[C@@]3([H])OC(C)(C)OC[C@]33[C@@]4([H])[C@@H](C[C@]5(C)[C@@H](CO)CC[C@]5(O)[C@]4([H])CC[C@]3(O)C1)OCOC)O[C@@H](C)[C@@H]2OCOC