Reaction Details
TargetGastrin/cholecystokinin type B receptor
LigandBDBM50007932
Substrate/Competitorn/a
Meas. Tech.ChEBML_48091
Ki 660±n/a nM
Citation Gonzalez-Muniz, RBergeron, FMarseigne, IDurieux, CRoques, BP Boc-Trp-Orn(Z)-Asp-NH2 and derivatives: a new family of CCK antagonists. J Med Chem33:3199-204 (1991) Gastrin/cholecystokinin type B receptor
Name:Gastrin/cholecystokinin type B receptor
Type:G Protein-Coupled Receptor (GPCR)
Mol. Mass.:48445.79
Organism:Homo sapiens (Human)
Description:Stable expression of human CCK-2 receptors in HEK 293 cells.
Residue:447
BDBM50007932
NameBDBM50007932
Synonyms:Boc-Tyr(SO3H)NLe-Gly-Trp-Orn(Z)-Asp-NH2 | CHEMBL2370441
TypeSmall organic molecule
Emp. Form.C56H76N10O16S
Mol. Mass.1177.325
SMILESCCCC[C@H](NC(=O)[C@H](Cc1ccc(cc1)S(O)(=O)=O)NC(=O)OC(C)(C)C)C(=O)NCC(=O)N[C@@H](Cc1c[nH]c2ccccc12)C(=O)N[C@@H](CCCNC(=O)OC(C)(C)C)C(=O)N[C@@H](CC(O)=O)C(=O)N[C@@H](Cc1ccccc1)C(N)=O