Reaction Details
TargetGastrin/cholecystokinin type B receptor
LigandBDBM50421881
Substrate/Competitorn/a
Meas. Tech.ChEBML_48091
Ki 100000±n/a nM
Citation Gonzalez-Muniz, RBergeron, FMarseigne, IDurieux, CRoques, BP Boc-Trp-Orn(Z)-Asp-NH2 and derivatives: a new family of CCK antagonists. J Med Chem33:3199-204 (1991) Gastrin/cholecystokinin type B receptor
Name:Gastrin/cholecystokinin type B receptor
Type:G Protein-Coupled Receptor (GPCR)
Mol. Mass.:48445.79
Organism:Homo sapiens (Human)
Description:Stable expression of human CCK-2 receptors in HEK 293 cells.
Residue:447
BDBM50421881
NameBDBM50421881
Synonyms:CHEMBL2112488
TypeSmall organic molecule
Emp. Form.C25H36N6O7
Mol. Mass.532.5893
SMILESCC(C)(C)OC(=O)N[C@@H](Cc1c[nH]c2ccccc12)C(=O)N[C@@H](CCCN)C(=O)N[C@@H](CC(O)=O)C(N)=O