Reaction Details
TargetCholecystokinin receptor type A
LigandBDBM50228603
Substrate/Competitorn/a
Meas. Tech.ChEMBL_49721 (CHEMBL661964)
Ki 200±n/a nM
Citation Gonzalez-Muniz, RBergeron, FMarseigne, IDurieux, CRoques, BP Boc-Trp-Orn(Z)-Asp-NH2 and derivatives: a new family of CCK antagonists. J Med Chem33:3199-204 (1991) Cholecystokinin receptor type A
Name:Cholecystokinin receptor type A
Type:n/a
Mol. Mass.:48229.77
Organism:Cavia porcellus
Description:n/a
Residue:430
BDBM50228603
NameBDBM50228603
Synonyms:CHEMBL3350278
TypeSmall organic molecule
Emp. Form.C33H42N6O9
Mol. Mass.666.7214
SMILESCC(C)(C)OC(=O)N[C@@H](Cc1c[nH]c2ccccc12)C(=O)N[C@@H](CCCNC(=O)OCc1ccccc1)C(=O)N[C@@H](CC(O)=O)C(N)=O