Reaction Details
TargetDelta-type opioid receptor
LigandBDBM50007965
Substrate/Competitorn/a
Meas. Tech.ChEBML_146590
Ki 7.8±n/a nM
Citation Roubini, ELaufer, RGilon, CSelinger, ZRoques, BPChorev, M Pseudopeptide analogues of substance P and leucine enkephalinamide containing the psi (CH2O) modification: synthesis and biological activity. J Med Chem34:2430-8 (1991) Delta-type opioid receptor
Name:Delta-type opioid receptor
Type:G Protein-Coupled Receptor (GPCR)
Mol. Mass.:40465.04
Organism:Rattus norvegicus (rat)
Description:Competition binding assays were using CHO-K1 cell membranes expressing the opioid receptor.
Residue:372
BDBM50007965
NameBDBM50007965
Synonyms:CHEMBL312194 Tyr(psi)CH2O-Gly-Gly-PheLeu-NH2
TypeSmall organic molecule
Emp. Form.C28H39N5O6
Mol. Mass.541.6392
SMILESCC(C)C[C@H](NC(=O)[C@H](Cc1ccccc1)NC(=O)CNC(=O)COC[C@@H](N)Cc1ccc(O)cc1)C(N)=O