Reaction Details
TargetMu-type opioid receptor
LigandBDBM50007966
Substrate/Competitorn/a
Meas. Tech.ChEBML_146541
Ki 1380±n/a nM
Citation Roubini, ELaufer, RGilon, CSelinger, ZRoques, BPChorev, M Pseudopeptide analogues of substance P and leucine enkephalinamide containing the psi (CH2O) modification: synthesis and biological activity. J Med Chem34:2430-8 (1991) Mu-type opioid receptor
Name:Mu-type opioid receptor
Type:G Protein-Coupled Receptor (GPCR)
Mol. Mass.:44503.11
Organism:Rattus norvegicus (rat)
Description:Competition binding assays were carried out using membrane preparations from transfected HN9.10 cells that constitutively expressed the mu opioid receptor.
Residue:398
BDBM50007966
NameBDBM50007966
Synonyms:CHEMBL420022 | Tyr-Gly(psi)CH2O-Gly-PheLeu-NH2
TypeSmall organic molecule
Emp. Form.C28H39N5O6
Mol. Mass.541.6392
SMILESCC(C)C[C@H](NC(=O)[C@H](Cc1ccccc1)NC(=O)COCCNC(=O)[C@@H](N)Cc1ccc(O)cc1)C(N)=O