Reaction Details
TargetReverse transcriptase/RNaseH
LigandBDBM50008010
Substrate/Competitorn/a
Meas. Tech.ChEBML_196945
IC50>100000±n/a nM
Citation Goudgaon, NMSchinazi, RF Activity of acyclic 6-(phenylselenenyl)pyrimidine nucleosides against human immunodeficiency viruses in primary lymphocytes. J Med Chem34:3305-9 (1991) Reverse transcriptase/RNaseH
Name:Reverse transcriptase/RNaseH
Type:PROTEIN
Mol. Mass.:65229.15
Organism:Human immunodeficiency virus 1
Description:ChEMBL_1473730
Residue:566
BDBM50008010
NameBDBM50008010
Synonyms:1-(2-Hydroxy-ethoxymethyl)-5-methyl-6-phenylselanyl-2-thioxo-2,3-dihydro-1H-pyrimidin-4-one | CHEMBL113581
TypeSmall organic molecule
Emp. Form.C14H16N2O3SSe
Mol. Mass.371.31
SMILESCc1c([Se]c2ccccc2)n(COCCO)c(=S)[nH]c1=O