Reaction Details
TargetReverse transcriptase/RNaseH
LigandBDBM50008012
Substrate/Competitorn/a
Meas. Tech.ChEBML_196945
IC50>100000±n/a nM
Citation Goudgaon, NMSchinazi, RF Activity of acyclic 6-(phenylselenenyl)pyrimidine nucleosides against human immunodeficiency viruses in primary lymphocytes. J Med Chem34:3305-9 (1991) Reverse transcriptase/RNaseH
Name:Reverse transcriptase/RNaseH
Type:PROTEIN
Mol. Mass.:65229.15
Organism:Human immunodeficiency virus 1
Description:ChEMBL_1473730
Residue:566
BDBM50008012
NameBDBM50008012
Synonyms:5-Bromo-1-(2-hydroxy-ethoxymethyl)-6-phenylselanyl-1H-pyrimidine-2,4-dione | CHEMBL334044
TypeSmall organic molecule
Emp. Form.C13H13BrN2O4Se
Mol. Mass.420.12
SMILESOCCOCn1c([Se]c2ccccc2)c(Br)c(=O)[nH]c1=O