Reaction Details
TargetcAMP-specific 3',5'-cyclic phosphodiesterase 4B
LigandBDBM50256195
Substrate/Competitorn/a
Meas. Tech.ChEBML_1687585
IC50 0.045000±n/a nM
Citation Roberts, RSSevilla, SFerrer, MTaltavull, JHernández, BSegarra, VGràcia, JLehner, MDGavaldà, AAndrés, MCabedo, JVilella, DEichhorn, PCalama, ECarcasona, CMiralpeix, M 4-Amino-7,8-dihydro-1,6-naphthyridin-5(6 H)-ones as Inhaled Phosphodiesterase Type 4 (PDE4) Inhibitors: Structural Biology and Structure-Activity Relationships. J Med Chem61:2472-2489 (2018) 
 
cAMP-specific 3',5'-cyclic phosphodiesterase 4B
Name:cAMP-specific 3',5'-cyclic phosphodiesterase 4B
Type:Protein
Mol. Mass.:83318.87
Organism:Homo sapiens (Human)
Description:Q07343
Residue:736
BDBM50256195
NameBDBM50256195
Synonyms:CHEMBL4095320
TypeSmall organic molecule
Emp. Form.C33H27N5O3
Mol. Mass.541.5992
SMILES[O-][n+]1cccc2c(Nc3cc(nc4CCNC(=O)c34)-c3cccc(c3)-c3cccc(c3)C(=O)NC3CC3)cccc12