Reaction Details
TargetBromodomain-containing protein 4
LigandBDBM179283
Substrate/Competitorn/a
Meas. Tech.ChEMBL_1687822 (CHEMBL4038392)
Ki 17±n/a nM
Citation Hasvold, LASheppard, GSWang, LFidanze, SDLiu, DPratt, JKMantei, RAWada, CKHubbard, RShen, YLin, XHuang, XWarder, SEWilcox, DLi, LBuchanan, FGSmithee, LAlbert, DHMagoc, TJPark, CHPetros, AMPanchal, SCSun, CKovar, PSoni, NBElmore, SWKati, WMMcDaniel, KF Methylpyrrole inhibitors of BET bromodomains. Bioorg Med Chem Lett27:2225-2233 (2017) 
 
Bromodomain-containing protein 4
Name:Bromodomain-containing protein 4
Type:Protein
Mol. Mass.:152264.84
Organism:Homo sapiens (Human)
Description:O60885
Residue:1362
BDBM179283
NameBDBM179283
Synonyms:US9125915, compound 6
TypeSmall organic molecule
Emp. Form.C20H19ClN4O2S
Mol. Mass.414.908
SMILESCOC(=O)C[C@@H]1N=C(c2c(C)c(C)sc2-n2c(C)nnc12)c1ccc(Cl)cc1