Reaction Details
TargetCholinesterase
LigandBDBM50256407
Substrate/Competitorn/a
Meas. Tech.ChEBML_1687867
IC50 24970±n/a nM
Citation Dias, KSde Paula, CTDos Santos, TSouza, INBoni, MSGuimarães, MJda Silva, FMCastro, NGNeves, GAVeloso, CCCoelho, MMde Melo, ISGiusti, FCGiusti-Paiva, Ada Silva, MLDardenne, LEGuedes, IAPruccoli, LMorroni, FTarozzi, AViegas, C Design, synthesis and evaluation of novel feruloyl-donepezil hybrids as potential multitarget drugs for the treatment of Alzheimer's disease. Eur J Med Chem130:440-457 (2017) 
 
Cholinesterase
Name:Cholinesterase
Type:Enzyme
Mol. Mass.:65643.35
Organism:Equus caballus (Horse)
Description:P81908
Residue:574
BDBM50256407
NameBDBM50256407
Synonyms:CHEMBL4088197
TypeSmall organic molecule
Emp. Form.C23H27NO4
Mol. Mass.381.4648
SMILESCOc1cc(\C=C\C(=O)OCC2CCN(Cc3ccccc3)CC2)ccc1O