Reaction Details
TargetTransient receptor potential cation channel subfamily V member 1
LigandBDBM50256546
Substrate/Competitorn/a
Meas. Tech.ChEBML_1688140
Ki 0.300000±n/a nM
Citation Lee, SKang, DWRyu, HKim, CAnn, JLee, HKim, EHong, SChoi, SBlumberg, PMFrank-Foltyn, RBahrenberg, GStockhausen, HChristoph, TLee, J t-Butyl pyridine and phenyl C-region analogues of 2-(3-fluoro-4-methylsulfonylaminophenyl)propanamides as potent TRPV1 antagonists. Bioorg Med Chem25:2451-2462 (2017) 
 
Transient receptor potential cation channel subfamily V member 1
Name:Transient receptor potential cation channel subfamily V member 1
Type:Protein
Mol. Mass.:94960.75
Organism:Homo sapiens (Human)
Description:Q8NER1
Residue:839
BDBM50256546
NameBDBM50256546
Synonyms:CHEMBL4105672
TypeSmall organic molecule
Emp. Form.C32H41FN4O3S
Mol. Mass.580.756
SMILESCC(C(=O)NCc1ccc(nc1N1CCC(Cc2ccccc2)CC1)C(C)(C)C)c1ccc(NS(C)(=O)=O)c(F)c1