Reaction Details
TargetMu-type opioid receptor
LigandBDBM50359546
Substrate/Competitorn/a
Meas. Tech.ChEBML_1688176
Ki 0.560000±n/a nM
Citation Adamska-Bart?omiejczyk, ADe Marco, RGentilucci, LKluczyk, AJanecka, A Design and characterization of opioid ligands based on cycle-in-macrocycle scaffold. Bioorg Med Chem25:2399-2405 (2017) 
 
Mu-type opioid receptor
Name:Mu-type opioid receptor
Type:G Protein-Coupled Receptor (GPCR)
Mol. Mass.:44789.51
Organism:Homo sapiens (Human)
Description:P35372
Residue:400
BDBM50359546
NameBDBM50359546
Synonyms:CHEMBL1927270
TypeSmall organic molecule
Emp. Form.C37H45N7O7
Mol. Mass.699.7959
SMILESN[C@@H](Cc1ccc(O)cc1)C(=O)N[C@@H]1CCCCNC(=O)C[C@H](NC(=O)[C@H](Cc2ccccc2)NC(=O)[C@H](Cc2ccccc2)NC1=O)C(N)=O