Reaction Details
TargetTyrosine-protein phosphatase non-receptor type 1
LigandBDBM50256792
Substrate/Competitorn/a
Meas. Tech.ChEBML_1688196
Ki 1210±n/a nM
Citation Tan, XFUddin, ZPark, CSong, YHSon, MLee, KWPark, KH Competitive protein tyrosine phosphatase 1B (PTP1B) inhibitors, prenylated caged xanthones from Garcinia hanburyi and their inhibitory mechanism. Bioorg Med Chem25:2498-2506 (2017) 
 
Tyrosine-protein phosphatase non-receptor type 1
Name:Tyrosine-protein phosphatase non-receptor type 1
Type:Protein phosphatase
Mol. Mass.:49963.76
Organism:Homo sapiens (Human)
Description:Human recombinant GST-fusion PTP1B (1-435).
Residue:435
BDBM50256792
NameBDBM50256792
Synonyms:Gambogenic Acid
TypeSmall organic molecule
Emp. Form.C38H46O8
Mol. Mass.630.767
SMILES[H][C@@]12[#6][C@@]3([H])[#6]=[#6]4-[#6](=O)-c5c(-[#8])c(-[#6]\[#6]=[#6](/[#6])-[#6]-[#6]\[#6]=[#6](\[#6])-[#6])c(-[#8])c(-[#6]\[#6]=[#6](\[#6])-[#6])c5-[#8][C@@]14[C@@]([#6]\[#6]=[#6](\[#6])-[#6](-[#8])=O)([#8]C2([#6])[#6])[#6]3=O