Reaction Details
TargetSigma non-opioid intracellular receptor 1
LigandBDBM50256809
Substrate/Competitorn/a
Meas. Tech.ChEMBL_1688265 (CHEMBL4038835)
Ki 782±n/a nM
Citation Asare-Nkansah, SSchepmann, DWünsch, B Synthesis of conformationally restricted 1,3-dioxanes to analyze the bioactive conformation of 1,3-dioxane-based? Bioorg Med Chem25:2472-2481 (2017) 
 
Sigma non-opioid intracellular receptor 1
Name:Sigma non-opioid intracellular receptor 1
Type:Protein
Mol. Mass.:25307.17
Organism:Cavia porcellus (Guinea pig)
Description:Q60492
Residue:223
BDBM50256809
NameBDBM50256809
Synonyms:CHEMBL4066462
TypeSmall organic molecule
Emp. Form.C27H29NO2
Mol. Mass.399.5247
SMILESC(CN(Cc1ccccc1)Cc1ccccc1)C1CC2OC(Cc3ccccc23)O1