Reaction Details
TargetMu-type opioid receptor
LigandBDBM21123
Substrate/Competitorn/a
Meas. Tech.ChEBML_1688498
Ki 2.1±n/a nM
Citation Wang, YZhao, XGao, XGan, YLiu, YZhao, XHu, JMa, XWu, YMa, PLiang, XZhang, X Original endomorphin-1 analogues exhibit good analgesic effects with minimal implications for human sperm motility. Bioorg Med Chem Lett27:2119-2123 (2017) 
 
Mu-type opioid receptor
Name:Mu-type opioid receptor
Type:G Protein-Coupled Receptor (GPCR)
Mol. Mass.:44503.11
Organism:Rattus norvegicus (rat)
Description:Competition binding assays were carried out using membrane preparations from transfected HN9.10 cells that constitutively expressed the mu opioid receptor.
Residue:398
BDBM21123
NameBDBM21123
Synonyms:(2S)-2-{2-[(2R)-2-[(2S)-2-amino-3-(4-hydroxyphenyl)propanamido]propanamido]acetamido}-3-phenylpropanamide YDAGF-NH2
TypePeptide
Emp. Form.C23H29N5O5
Mol. Mass.455.5069
SMILESC[C@@H](NC(=O)[C@@H](N)Cc1ccc(O)cc1)C(=O)NCC(=O)N[C@@H](Cc1ccccc1)C(N)=O