Reaction Details
TargetDelta-type opioid receptor
LigandBDBM50256911
Substrate/Competitorn/a
Meas. Tech.ChEBML_1688499
Ki 101±n/a nM
Citation Wang, YZhao, XGao, XGan, YLiu, YZhao, XHu, JMa, XWu, YMa, PLiang, XZhang, X Original endomorphin-1 analogues exhibit good analgesic effects with minimal implications for human sperm motility. Bioorg Med Chem Lett27:2119-2123 (2017) 
 
Delta-type opioid receptor
Name:Delta-type opioid receptor
Type:G Protein-Coupled Receptor (GPCR)
Mol. Mass.:40465.04
Organism:Rattus norvegicus (rat)
Description:Competition binding assays were using CHO-K1 cell membranes expressing the opioid receptor.
Residue:372
BDBM50256911
NameBDBM50256911
Synonyms:CHEMBL4095621
TypeSmall organic molecule
Emp. Form.C24H30ClN7O5
Mol. Mass.531.992
SMILESC[C@@H](NC(=O)[C@H](Cc1ccc(O)cc1)NC(N)=N)C(=O)NCC(=O)N[C@@H](Cc1ccc(Cl)cc1)C(N)=O