Reaction Details
TargetMu-type opioid receptor
LigandBDBM50256914
Substrate/Competitorn/a
Meas. Tech.ChEBML_1688498
Ki 0.420000±n/a nM
Citation Wang, YZhao, XGao, XGan, YLiu, YZhao, XHu, JMa, XWu, YMa, PLiang, XZhang, X Original endomorphin-1 analogues exhibit good analgesic effects with minimal implications for human sperm motility. Bioorg Med Chem Lett27:2119-2123 (2017) 
 
Mu-type opioid receptor
Name:Mu-type opioid receptor
Type:G Protein-Coupled Receptor (GPCR)
Mol. Mass.:44503.11
Organism:Rattus norvegicus (rat)
Description:Competition binding assays were carried out using membrane preparations from transfected HN9.10 cells that constitutively expressed the mu opioid receptor.
Residue:398
BDBM50256914
NameBDBM50256914
Synonyms:CHEMBL4061665
TypeSmall organic molecule
Emp. Form.C24H31N7O5
Mol. Mass.497.5468
SMILESC[C@@H](NC(=O)[C@H](Cc1ccc(O)cc1)NC(N)=N)C(=O)NCC(=O)N[C@@H](Cc1ccccc1)C(N)=O