Reaction Details
TargetC5a anaphylatoxin chemotactic receptor 1
LigandBDBM50008228
Substrate/Competitorn/a
Meas. Tech.ChEBML_41471
Ki 25000±n/a nM
Citation Kawai, MQuincy, DALane, BMollison, KWOr, YSLuly, JRCarter, GW Structure-function studies in a series of carboxyl-terminal octapeptide analogues of anaphylatoxin C5a. J Med Chem35:220-3 (1992) C5a anaphylatoxin chemotactic receptor 1
Name:C5a anaphylatoxin chemotactic receptor 1
Type:Enzyme
Mol. Mass.:39347.68
Organism:Homo sapiens (Human)
Description:P21730
Residue:350
BDBM50008228
NameBDBM50008228
Synonyms:2-[2-(2-{2-[2-(2-{2-[2-Acetylamino-3-(3H-imidazol-4-yl)-propionylamino]-6-amino-hexanoylamino}-3-carboxy-propionylamino)-3-cyclohexyl-propionylamino]-3-cyclohexyl-propionylamino}-3-cyclohexyl-propionylamino)-acetylamino]-5-guanidino-pentanoic acid | CHEMBL2369493
TypeSmall organic molecule
Emp. Form.C53H88N14O12
Mol. Mass.1113.3524
SMILESCC(=O)N[C@@H](Cc1c[nH]cn1)C(=O)N[C@@H](CCCCN)C(=O)N[C@@H](CC(O)=O)C(=O)N[C@@H](CC1CCCCC1)C(=O)N[C@@H](CC1CCCCC1)C(=O)N[C@@H](CC1CCCCC1)C(=O)NCC(=O)N[C@@H](CCCN=C(N)N)C(O)=O