Reaction Details
TargetD(2) dopamine receptor
LigandBDBM50027074
Substrate/Competitorn/a
Meas. Tech.ChEMBL_1688593 (CHEMBL4039163)
Ki>100000±n/a nM
Citation Lindsley, CWHopkins, CR Return of D J Med Chem60:7233-7243 (2017) 
 
D(2) dopamine receptor
Name:D(2) dopamine receptor
Type:Cell-surface receptors
Mol. Mass.:50647.10
Organism:Homo sapiens (Human)
Description:P14416
Residue:443
BDBM50027074
NameBDBM50027074
Synonyms:CHEMBL3335537
TypeSmall organic molecule
Emp. Form.C20H23N3O
Mol. Mass.321.4161
SMILESC(Cc1ccccc1)[C@@H]1CN(Cc2nc3ccccc3[nH]2)CCO1