Reaction Details
TargetD(3) dopamine receptor
LigandBDBM50027074
Substrate/Competitorn/a
Meas. Tech.ChEBML_1688594
Ki 15700±n/a nM
Citation Lindsley, CWHopkins, CR Return of D J Med Chem60:7233-7243 (2017) 
 
D(3) dopamine receptor
Name:D(3) dopamine receptor
Type:n/a
Mol. Mass.:44243.43
Organism:Homo sapiens (Human)
Description:n/a
Residue:400
BDBM50027074
NameBDBM50027074
Synonyms:CHEMBL3335537
TypeSmall organic molecule
Emp. Form.C20H23N3O
Mol. Mass.321.4161
SMILESC(Cc1ccccc1)[C@@H]1CN(Cc2nc3ccccc3[nH]2)CCO1