Reaction Details
TargetD(1A) dopamine receptor
LigandBDBM50027074
Substrate/Competitorn/a
Meas. Tech.ChEBML_1688592
Ki>100000±n/a nM
Citation Lindsley, CWHopkins, CR Return of D J Med Chem60:7233-7243 (2017) 
 
D(1A) dopamine receptor
Name:D(1A) dopamine receptor
Type:Enzyme
Mol. Mass.:49303.43
Organism:Homo sapiens (Human)
Description:P21728
Residue:446
BDBM50027074
NameBDBM50027074
Synonyms:CHEMBL3335537
TypeSmall organic molecule
Emp. Form.C20H23N3O
Mol. Mass.321.4161
SMILESC(Cc1ccccc1)[C@@H]1CN(Cc2nc3ccccc3[nH]2)CCO1